Butanedioic acid, ethyl methyl ester

Kovats' RI, non-polar column, custom temperature program

View large format table.

Column type Active phase I Reference Comment
CapillarySE-301116.Brander, Kepner, et al., 1980Column length: 80. m; Column diameter: 0.29 mm; Program: not specified
CapillarySE-301120.Brander, Kepner, et al., 1980Column length: 80. m; Column diameter: 0.29 mm; Program: not specified

Kovats' RI, polar column, custom temperature program

View large format table.

Column type Active phase I Reference Comment
CapillaryCarbowax 20M1641.Brander, Kepner, et al., 1980Program: not specified
CapillaryCarbowax 20M1642.Brander, Kepner, et al., 1980Program: not specified

Van Den Dool and Kratz RI, non-polar column, temperature ramp

View large format table.

Column type Active phase I Reference Comment
CapillaryOV-11070.Tan, Holland, et al., 1988He, 8. K/min, 280. C @ 10. min; Column length: 25. m; Column diameter: 0.32 mm; Tstart: 40. C

Van Den Dool and Kratz RI, polar column, temperature ramp

View large format table.

Column type Active phase I Reference Comment
CapillaryZB-Wax1632.Ledauphin, Saint-Clair, et al., 200430. m/0.25 mm/0.15 μm, He, 35. C @ 10. min, 1.8 K/min, 220. C @ 10. min
CapillaryDB-Wax1631.Umano, Hagi, et al., 1992He, 40. C @ 10. min, 2. K/min; Column length: 30. m; Column diameter: 0.25 mm; Tend: 200. C

Normal alkane RI, non-polar column, custom temperature program

View large format table.

Column type Active phase I Reference Comment
CapillarySF-961120.Fagan, Kepner, et al., 1982He; Program: not specified
CapillarySF-961121.Fagan, Kepner, et al., 1982He; Program: not specified

Normal alkane RI, polar column, temperature ramp

View large format table.

Column type Active phase I Reference Comment
CapillaryDB-Wax1631.Zhao, Xu, et al., 200930. m/0.25 mm/0.25 μm, Helium, 40. C @ 2. min, 3. K/min, 230. C @ 5. min

Normal alkane RI, polar column, custom temperature program

View large format table.

Column type Active phase I Reference Comment
CapillaryDB-Wax1632.Zhao, Xu, et al., 200930. m/0.25 mm/0.25 μm, Helium; Program: not specified
CapillaryCarbowax 20M1605.Vinogradov, 2004Program: not specified
CapillaryCarbowax 20M1630.Fagan, Kepner, et al., 1982He; Column length: 60. m; Column diameter: 0.25 mm; Program: not specified
CapillaryCarbowax 20M1641.Fagan, Kepner, et al., 1982He; Column length: 60. m; Column diameter: 0.25 mm; Program: not specified

References

Brander, Kepner, et al., 1980
Brander, C.F.; Kepner, R.E.; Webb, A.D., Identification of Some Volatile Compounds of Wine of Vitis Vinifera Cultivar Pinot Noir, Am. J. Enol. Vitic, 1980, 31, 1, 69-75. [all data]

Tan, Holland, et al., 1988
Tan, S.-T.; Holland, P.T.; Wilkins, A.L.; Molan, P.C., Extractives from New Zealand honeys. 1. White clovers, manuka, and kanuka unifloral honeys, J. Agric. Food Chem., 1988, 36, 3, 453-460, https://doi.org/10.1021/jf00081a012 . [all data]

Ledauphin, Saint-Clair, et al., 2004
Ledauphin, J.; Saint-Clair, J.-F.; Lablanquie, O.; Guichard, H.; Founier, N.; Guichard, E.; Barillier, D., Identification of trace volatile compounds in freshly distilled calvados and cognac using preparative separations coupled with gas chromatography-mass spectrometry, J. Agric. Food Chem., 2004, 52, 16, 5124-5134, https://doi.org/10.1021/jf040052y . [all data]

Umano, Hagi, et al., 1992
Umano, K.; Hagi, Y.; Nakahara, K.; Shoji, A.; Shibamoto, T., Volatile constituents of green and ripened pineapple (Aanas comosus [L.] Merr.), J. Agric. Food Chem., 1992, 40, 4, 599-603, https://doi.org/10.1021/jf00016a014 . [all data]

Fagan, Kepner, et al., 1982
Fagan, G.L.; Kepner, R.E.; Webb, A.D., Additional volatile components of Palomino film sherry, Am. J. Enol. Vitic, 1982, 33, 1, 47-50. [all data]

Zhao, Xu, et al., 2009
Zhao, Y.; Xu, Y.; Li, J.; Fan, W.; Jiang, W., Profile of volatile compounds in 11 brandies by headspace solid-phase microextraction followed by gas chromatography-mass spectrometry, J. Food. Sci., 2009, 74, 2, c90-c99, https://doi.org/10.1111/j.1750-3841.2008.01029.x . [all data]

Vinogradov, 2004
Vinogradov, B.A., Production, composition, properties and application of essential oils, 2004, retrieved from http://viness.narod.ru. [all data]