Acetic acid, ethoxy-

Phase change data

Data compiled as indicated in comments:
BS - Robert L. Brown and Stephen E. Stein
AC - William E. Acree, Jr., James S. Chickos

Quantity Value Units Method Reference Comment
Tboil479.7KN/AWeast and Grasselli, 1989BS

Reduced pressure boiling point

Tboil (K) Pressure (bar) Reference Comment
371.70.015Aldrich Chemical Company Inc., 1990BS

Enthalpy of vaporization

ΔvapH (kJ/mol) Temperature (K) Method Reference Comment
69.1295.AStephenson and Malanowski, 1987Based on data from 280. - 310. K.; AC

Gas phase ion energetics data

Data compiled by: John E. Bartmess

De-protonation reactions

C4H7O3- + Hydrogen cation = Acetic acid, ethoxy-

By formula: C4H7O3- + H+ = C4H8O3

Quantity Value Units Method Reference Comment
Δr1431. ± 9.2kJ/molG+TSCaldwell, Renneboog, et al., 1989gas phase
Quantity Value Units Method Reference Comment
Δr1402. ± 8.4kJ/molIMRECaldwell, Renneboog, et al., 1989gas phase

Reaction thermochemistry data

Data compiled by: John E. Bartmess

Individual Reactions

C4H7O3- + Hydrogen cation = Acetic acid, ethoxy-

By formula: C4H7O3- + H+ = C4H8O3

Quantity Value Units Method Reference Comment
Δr342.0 ± 2.2kcal/molG+TSCaldwell, Renneboog, et al., 1989gas phase
Quantity Value Units Method Reference Comment
Δr335.0 ± 2.0kcal/molIMRECaldwell, Renneboog, et al., 1989gas phase

References

Weast and Grasselli, 1989
CRC Handbook of Data on Organic Compounds, 2nd Editon, Weast,R.C and Grasselli, J.G., ed(s)., CRC Press, Inc., Boca Raton, FL, 1989, 1. [all data]

Aldrich Chemical Company Inc., 1990
Aldrich Chemical Company Inc., Catalog Handbook of Fine Chemicals, Aldrich Chemical Company, Inc., Milwaukee WI, 1990, 1. [all data]

Stephenson and Malanowski, 1987
Stephenson, Richard M.; Malanowski, Stanislaw, Handbook of the Thermodynamics of Organic Compounds, 1987, https://doi.org/10.1007/978-94-009-3173-2 . [all data]