2-Pentenoic acid

Condensed phase thermochemistry data

Data compiled by: Hussein Y. Afeefy, Joel F. Liebman, and Stephen E. Stein

Quantity Value Units Method Reference Comment
Δcliquid-2664.4 ± 2.5kJ/molCcbSchjanberg, 1937Reanalyzed by Cox and Pilcher, 1970, Original value = -2664. ± 8. kJ/mol; At 293 K; Corresponding Δfliquid = -446.52 kJ/mol (simple calculation by NIST; no Washburn corrections)

Normal alkane RI, non-polar column, temperature ramp

View large format table.

Column type Active phase I Reference Comment
CapillarySPB-5873.Doneanu and Anitescu, 199850. m/0.32 mm/0.25 μm, He, 3. K/min, 240. C @ 20. min; Tstart: 60. C

References

Schjanberg, 1937
Schjanberg, E., Die verbrennungswarmen und die refraktionsdaten einiger pentensaureeste, Z. Phys. Chem., 1937, 178, 274-281. [all data]

Cox and Pilcher, 1970
Cox, J.D.; Pilcher, G., Thermochemistry of Organic and Organometallic Compounds, Academic Press, New York, 1970, 1-636. [all data]