Ethanol, 2-methoxy-, carbonate (2:1)

Phase change data

Data compiled by: Thermodynamics Research Center, NIST Boulder Laboratories, Chris Muzny director

Quantity Value Units Method Reference Comment
Tc603.5KN/ALawrenson and Lee, 1978Uncertainty assigned by TRC = 0.7 K; Visual, decomp.

In addition to the Thermodynamics Research Center (TRC) data available from this site, much more physical and chemical property data is available from the following TRC products:

References

Lawrenson and Lee, 1978
Lawrenson, I.J.; Lee, D.A., Thermodynamic properties of organic oxygen compounds XLVIII. The critical temperature of some alkanols, J. Chem. Thermodyn., 1978, 10, 1111. [all data]