Benzene, (3-chloroallyl)-

Phase change data

Data compiled as indicated in comments:
BS - Robert L. Brown and Stephen E. Stein
TRC - Thermodynamics Research Center, NIST Boulder Laboratories, Chris Muzny director

Quantity Value Units Method Reference Comment
Tboil486.2KN/AWeast and Grasselli, 1989BS
Tboil481.65KN/ASchmerling and West, 1953Uncertainty assigned by TRC = 2. K; TRC

Reduced pressure boiling point

Tboil (K) Pressure (bar) Reference Comment
370.20.024Weast and Grasselli, 1989BS

In addition to the Thermodynamics Research Center (TRC) data available from this site, much more physical and chemical property data is available from the following TRC products:

References

Weast and Grasselli, 1989
CRC Handbook of Data on Organic Compounds, 2nd Editon, Weast,R.C and Grasselli, J.G., ed(s)., CRC Press, Inc., Boca Raton, FL, 1989, 1. [all data]

Schmerling and West, 1953
Schmerling, L.; West, J.P., The Peroxide-induced Condensation of Polychloroethylenes with Aromatic Hydrocarbons, J. Am. Chem. Soc., 1953, 75, 6216. [all data]