Benzene, [(ethylthio)methyl]-

Kovats' RI, non-polar column, isothermal

View large format table.

Column type Active phase Temperature (C) I Reference Comment
PackedApiezon M130.1248.Garbuzov, Misharina, et al., 1985He or N2, Chromosorb W, AW-DMCS; Column length: 2.1 m
PackedApiezon M130.1248.Golovnya, Garbuzov, et al., 1978Chromosorb W, AW/DMS; Column length: 2.1 m

Normal alkane RI, non-polar column, custom temperature program

View large format table.

Column type Active phase I Reference Comment
PackedApiezon M1246.Golovnya, Misharina, et al., 1983N2, Chromosorb W AW/DMCS; Column length: 5.6 m; Program: 60C(7min), 100C(7min), 150C isothermal

Condensed phase thermochemistry data

Data compiled by: Hussein Y. Afeefy, Joel F. Liebman, and Stephen E. Stein

Quantity Value Units Method Reference Comment
Δfliquid-1.25 ± 0.52kcal/molCcrMackle and Mayrick, 1962
Quantity Value Units Method Reference Comment
Δcliquid-1398.95 ± 0.51kcal/molCcrMackle and Mayrick, 1962

References

Garbuzov, Misharina, et al., 1985
Garbuzov, V.G.; Misharina, T.A.; Aerov, A.F.; Golovnya, R.V., Gas chromatographic retention indices for sulphur(II)-containing organic substances, J. Anal. Chem. USSR (Engl. Transl.), 1985, 40, 4, 576-586. [all data]

Golovnya, Garbuzov, et al., 1978
Golovnya, R.V.; Garbuzov, V.G.; Aerov, A.F., Gas chromatographic characterization of sulfur-containing compounds. 5. Thiophene, furan, and benzene derivatives, Izv. Akad. Nauk SSSR Ser. Khim., 1978, 11, 2271-2274. [all data]

Golovnya, Misharina, et al., 1983
Golovnya, R.V.; Misharina, T.A.; Garbuzov, V.G.; Medvedyev, F.A., Volatile sulfur containing compounds in simulated meat flavour and their comparison with the constituents of natural aroma, Nahrung, 1983, 27, 3, 237-249, https://doi.org/10.1002/food.19830270314 . [all data]