Benzene,1,1'-(1,3,5,7,9,11,13-tetradecaheptaene-1,14-diyl)bis-

Gas phase ion energetics data

Data compiled by: Sharon G. Lias, Rhoda D. Levin, and Sherif A. Kafafi

Ionization energy determinations

IE (eV) Method Reference
7.2 ± 0.2PEHudson, Ridyard, et al., 1976

References

Hudson, Ridyard, et al., 1976
Hudson, B.S.; Ridyard, J.N.A.; Diamond, J., Polyene spectroscopy. Photoelectron spectra of the diphenylpolyenes, J. Am. Chem. Soc., 1976, 98, 1126. [all data]