1,3,2-Benzodioxathiole, 2-oxide

Gas phase ion energetics data

Data compiled by: Sharon G. Lias, Rhoda D. Levin, and Sherif A. Kafafi

Ionization energy determinations

IE (eV) Method Reference Comment
9.1PEKoenig, Smith, et al., 1977Vertical value

References

Koenig, Smith, et al., 1977
Koenig, T.; Smith, M.; Snell, W., The He(I) photoelectron spectrum of cyclopentadienone, J. Am. Chem. Soc., 1977, 99, 6663. [all data]