Ethyl hypochlorite

Gas phase ion energetics data

Data compiled as indicated in comments:
LLK - Sharon G. Lias, Rhoda D. Levin, and Sherif A. Kafafi

Ionization energy determinations

IE (eV) Method Reference Comment
10.13 ± 0.02PEColbourne, Frost, et al., 1981LLK

References

Colbourne, Frost, et al., 1981
Colbourne, D.; Frost, D.C.; McDowell, C.A.; Westwood, N.P.C., The He(I) photoelectron spectra of the alkyl hypochlorites, ROCl (R = Me, Et and t-Bu), J. Electron Spectrosc. Relat. Phenom., 1981, 23, 109. [all data]