1,2-Difluoroethane

Phase change data

Data compiled by: Thermodynamics Research Center, NIST Boulder Laboratories, Chris Muzny director

Quantity Value Units Method Reference Comment
Tboil283.65KN/AHenne and Renoll, 1936Uncertainty assigned by TRC = 1. K

In addition to the Thermodynamics Research Center (TRC) data available from this site, much more physical and chemical property data is available from the following TRC products:

References

Henne and Renoll, 1936
Henne, A.L.; Renoll, M.W., J. Am. Chem. Soc., 1936, 58, 889. [all data]