Urea, N,N'-diethyl-

Gas phase thermochemistry data

Data compiled by: Hussein Y. Afeefy, Joel F. Liebman, and Stephen E. Stein

Quantity Value Units Method Reference Comment
Δfgas-282.9 ± 2.1kJ/molCcbKabo, Miroshnichenko, et al., 1990

References

Kabo, Miroshnichenko, et al., 1990
Kabo, G.Ya.; Miroshnichenko, E.A.; Frenkel, M.L.; Kozyro, A.A.; Simirskii, V.V.; Krasulin, A.P.; Vorob'eva, V.P.; Lebedev, Yu.A., Thermochemistry of urea alkyl derivatives, Bull. Acad. Sci. USSR, Div. Chem. Sci., 1990, 662-667. [all data]