N,N-Dimethylnonamide

Gas phase thermochemistry data

Data compiled by: Hussein Y. Afeefy, Joel F. Liebman, and Stephen E. Stein

Quantity Value Units Method Reference Comment
Δfgas-374.0kJ/molCcbVasil'eva and Kotov, 1977

References

Vasil'eva and Kotov, 1977
Vasil'eva, T.F.; Kotov, V.I., Heats of combustion of dimethyl-substituted amides and dimethylalkylamines, Vses. Konf. Kalorim. Rasshir. Tezisy Dokl. 7th, 1977, 1, 102-106. [all data]