C4HO4-2

Reaction thermochemistry data

Data compiled by: John E. Bartmess

Individual Reactions

C4O4-2 + Hydrogen cation = C4HO4-2

By formula: C4O4-2 + H+ = C4HO4-2

Quantity Value Units Method Reference Comment
Δr1756. ± 13.kJ/molD-EASkurski, Simons, et al., 2000gas phase; Vertical Detachment Energy: 0.60±0.10 eV; coulomb barrier ca. <80 kcal/mol

References

Skurski, Simons, et al., 2000
Skurski, P.; Simons, J.; Wang, X.B.; Wang, L.S., Experimental and theoretical investigations of the stability of two small gaseous dicarboxylate dianions: Acetylene dicarboxylate and succinate, J. Am. Chem. Soc., 2000, 122, 18, 4499-4507, https://doi.org/10.1021/ja000371f . [all data]