1-hexadecylcyclopentene

Phase change data

Data compiled by: Thermodynamics Research Center, NIST Boulder Laboratories, Chris Muzny director

Quantity Value Units Method Reference Comment
Tfus297.7KN/ASchmidt, 1942Uncertainty assigned by TRC = 0.5 K

In addition to the Thermodynamics Research Center (TRC) data available from this site, much more physical and chemical property data is available from the following TRC products:

References

Schmidt, 1942
Schmidt, A.W., Physical properties of aliphatic compounds, Ber. Dtsch. Chem. Ges. B, 1942, 75, 1399. [all data]