(1R,3R,4R,5S)-1-Isopropyl-4-methylbicyclo[3.1.0]hexan-3-yl acetate-rel-

Normal alkane RI, non-polar column, temperature ramp

Data compiled by: NIST Mass Spectrometry Data Center, William E. Wallace, director

Column type CapillaryCapillaryCapillaryCapillary
Active phase DB-1DB-1HP-5HP-5
Column length (m) 30.25.30.30.
Carrier gas HeHeHe
Substrate
Column diameter (mm) 0.250.250.250.25
Phase thickness (μm) 0.250.250.250.25
Tstart (C) 50.50.60.60.
Tend (C) 265.250.280.240.
Heat rate (K/min) 2.53.3.3.
Initial hold (min) 1.3.
Final hold (min) 20.
I 1294.1273.1298.1305.
ReferenceIranshahi, Amin, et al., 2006Cégiéla-Carlioz, Bessière, et al., 2005Pitarokili, Tzakou, et al., 2003Novak, Langbehn, et al., 2002
Comment MSDC-RI MSDC-RI MSDC-RI MSDC-RI

Van Den Dool and Kratz RI, non-polar column, custom temperature program

Data compiled by: NIST Mass Spectrometry Data Center, William E. Wallace, director

Column type Capillary
Active phase HP-5MS
Column length (m) 30.
Carrier gas He
Substrate
Column diameter (mm) 0.25
Phase thickness (μm) 0.25
Program 60C (1 min) => 5 C/min => 210C => 10 C/min => 280C (15 min)
I 1266.5
ReferenceAndriamaharavo, 2014
Comment MSDC-RI

References

Iranshahi, Amin, et al., 2006
Iranshahi, M.; Amin, G.; Sourmaghi, M.S.; Shafiee, A.; Hadjiakhoondi, A., Sulphur-containing compounds in the essential oil of the root of Ferula persica Willd. var. persica, Flavour Fragr. J., 2006, 21, 2, 260-261, https://doi.org/10.1002/ffj.1574 . [all data]

Cégiéla-Carlioz, Bessière, et al., 2005
Cégiéla-Carlioz, P.; Bessière, J.-M.; David, B.; Mariotte, A.-M.; Gibbons, S.; Dijoux-Franca, M.-G., Modulation of multi-drug resistance (MDR) in Staphylococcus aureus by Osha (Ligusticum porteri L., Apiaceae) essential oil compounds, Flavour Fragr. J., 2005, 20, 6, 671-675, https://doi.org/10.1002/ffj.1584 . [all data]

Pitarokili, Tzakou, et al., 2003
Pitarokili, D.; Tzakou, O.; Loukis, A.; Harvala, C., Volatile metabolites from Salvia fruticosa as antifungal agents in soilborne pathogens, J. Agric. Food Chem., 2003, 51, 11, 3294-3301, https://doi.org/10.1021/jf0211534 . [all data]

Novak, Langbehn, et al., 2002
Novak, J.; Langbehn, J.; Pank, F.; Franz. C.M., Essential oil compounds in a historical sample of marjoram (Origanum majorana L., Lamiaceae), Flavour Fragr. J., 2002, 17, 3, 175-180, https://doi.org/10.1002/ffj.1077 . [all data]