4-Butyldiphenylmethane

Condensed phase thermochemistry data

Data compiled by: Hussein Y. Afeefy, Joel F. Liebman, and Stephen E. Stein

Quantity Value Units Method Reference Comment
Δcliquid-2280.kcal/molCcbLamneck and Wise, 1954Corresponding Δfliquid = -2. kcal/mol (simple calculation by NIST; no Washburn corrections)

References

Lamneck and Wise, 1954
Lamneck, J.H., Jr.; Wise, P.H., Dicyclic hydrocarbons. X. Synthesis and physical properties of some propyl- and butyldiphenylmethanes and 4-isopropyldicyclohexylmethane, J. Am. Chem. Soc., 1954, 76, 3475-3476. [all data]