phenol, 5-ethyl-2,4-dimethyl-

Phase change data

Data compiled by: Thermodynamics Research Center, NIST Boulder Laboratories, Chris Muzny director

Quantity Value Units Method Reference Comment
Tboil516.15KN/AVon Auwers and Mauss, 1928Uncertainty assigned by TRC = 4. K
Quantity Value Units Method Reference Comment
Tfus312.65KN/AVon Auwers and Mauss, 1928Uncertainty assigned by TRC = 2. K

In addition to the Thermodynamics Research Center (TRC) data available from this site, much more physical and chemical property data is available from the following TRC products:

References

Von Auwers and Mauss, 1928
Von Auwers, K.; Mauss, W., Justus Liebigs Ann. Chem., 1928, 460, 240. [all data]