5-Methyl-2-(1-methylethyl)-1,4-benzoquinone monooxime

Condensed phase thermochemistry data

Data compiled by: Hussein Y. Afeefy, Joel F. Liebman, and Stephen E. Stein

Quantity Value Units Method Reference Comment
Δcsolid-5572.3kJ/molCcbSwietoslawski and Starczedska, 1925

References

Swietoslawski and Starczedska, 1925
Swietoslawski, W.; Starczedska, H., Correction des donnees thermochimiques de M.A. Valeur, J. Chem. Phys., 1925, 22, 399-401. [all data]