4-Pentenoic 2-methylpropyl ester

Phase change data

Data compiled by: Hussein Y. Afeefy, Joel F. Liebman, and Stephen E. Stein

Quantity Value Units Method Reference Comment
Δvap51. ± 1.kJ/molESchjanberg, 1937Heat of formation derived by Cox and Pilcher, 1970

Enthalpy of vaporization

ΔvapH (kJ/mol) Temperature (K) Method Reference Comment
41.293.VSchjanberg, 1937At 293 K

References

Schjanberg, 1937
Schjanberg, E., Die verbrennungswarmen und die refraktionsdaten einiger pentensaureeste, Z. Phys. Chem., 1937, 178, 274-281. [all data]

Cox and Pilcher, 1970
Cox, J.D.; Pilcher, G., Thermochemistry of Organic and Organometallic Compounds, Academic Press, New York, 1970, 1-636. [all data]