3-Pentenoic acid 2-methylpropyl ester

Condensed phase thermochemistry data

Data compiled by: Hussein Y. Afeefy, Joel F. Liebman, and Stephen E. Stein

Quantity Value Units Method Reference Comment
Δfliquid-505. ± 3.kJ/molCcbSchjanberg, 1937Heat of formation derived by Cox and Pilcher, 1970
Quantity Value Units Method Reference Comment
Δcliquid-5322.9 ± 2.5kJ/molCcbSchjanberg, 1937Reanalyzed by Cox and Pilcher, 1970, Original value = -5320. ± 8. kJ/mol; At 293 K; Corresponding Δfliquid = -505.34 kJ/mol (simple calculation by NIST; no Washburn corrections)

Phase change data

Data compiled by: Hussein Y. Afeefy, Joel F. Liebman, and Stephen E. Stein

Quantity Value Units Method Reference Comment
Δvap12.5 ± 0.3kcal/molESchjanberg, 1937Heat of formation derived by Cox and Pilcher, 1970

Enthalpy of vaporization

ΔvapH (kcal/mol) Temperature (K) Method Reference Comment
9.7293.VSchjanberg, 1937At 293 K

References

Schjanberg, 1937
Schjanberg, E., Die verbrennungswarmen und die refraktionsdaten einiger pentensaureeste, Z. Phys. Chem., 1937, 178, 274-281. [all data]

Cox and Pilcher, 1970
Cox, J.D.; Pilcher, G., Thermochemistry of Organic and Organometallic Compounds, Academic Press, New York, 1970, 1-636. [all data]