Cyclopentane, octadecyl-

Kovats' RI, non-polar column, isothermal

View large format table.

Column type Active phase Temperature (C) I Reference Comment
CapillaryOV-101190.2363.Kusmierz, Malinski, et al., 1985Column length: 22. m; Column diameter: 0.3 mm
CapillaryApiezon L190.2376.4Kusmierz, Malinski, et al., 1985He; Column length: 20. m; Column diameter: 0.3 mm
CapillarySE-52190.2368.1Kusmierz, Malinski, et al., 1985He; Column length: 40. m; Column diameter: 0.3 mm
CapillaryDexsil 300210.2386.Szafranek, Kusmierz, et al., 1982He; Column length: 30. m; Column diameter: 0.30 mm

Kovats' RI, polar column, isothermal

View large format table.

Column type Active phase Temperature (C) I Reference Comment
CapillaryCarbowax 20M150.2382.2Kusmierz, Malinski, et al., 1985He; Column length: 30. m; Column diameter: 0.25 mm

References

Kusmierz, Malinski, et al., 1985
Kusmierz, J.; Malinski, E.; Czerwiec, W.; Szafranek, J., Kováts retention indices of high-molecular-weight monomethyl-, cyclopentyl-, cyclohexyl- and phenylalkanes, J. Chromatogr., 1985, 331, 219-228, https://doi.org/10.1016/0021-9673(85)80027-3 . [all data]

Szafranek, Kusmierz, et al., 1982
Szafranek, J.; Kusmierz, J.; Czerwiec, W., Gas chromatographic-mass spectrometric investigations of high-boiling crude oil alkane fractions, J. Chromatogr., 1982, 245, 2, 219-228, https://doi.org/10.1016/S0021-9673(00)88591-X . [all data]