Digermathiane, hexamethyl-

Gas phase ion energetics data

Data compiled by: Sharon G. Lias, Rhoda D. Levin, and Sherif A. Kafafi

Ionization energy determinations

IE (eV) Method Reference Comment
8.6 ± 0.1EIDistefano, Ricci, et al., 1974
8.40 ± 0.05PEDistefano, Ricci, et al., 1974, 2Vertical value

References

Distefano, Ricci, et al., 1974
Distefano, G.; Ricci, A.; Danieli, R.; Foffani, A.; Innorta, G.; Torroni, S., Mass spectrometric evidence for p π-d π bonding between sulfur and the Group IVB elements, J. Organomet. Chem., 1974, 65, 205. [all data]

Distefano, Ricci, et al., 1974, 2
Distefano, G.; Ricci, A.; Colonna, F.P.; Pietropaolo, D.; Pignataro, S., Bonding between sulfur and the elements of Group IV studied by UV photoelectron spectroscopy, J. Organomet. Chem., 1974, 78, 93. [all data]