Phenol, 3,5-dichloro-, acetate

Kovats' RI, non-polar column, isothermal

Data compiled by: NIST Mass Spectrometry Data Center, William E. Wallace, director

Column type CapillaryCapillaryCapillary
Active phase SE-30OV-101OV-101
Column length (m) 25.25.25.
Carrier gas  N2N2
Substrate
Column diameter (mm) 0.320.220.22
Phase thickness (μm)
Temperature (C) 160.160.180.
I 1334.1334.1367.
ReferenceEvans and Haken, 1989Haken and Korhonen, 1983Haken and Korhonen, 1983
Comment MSDC-RI MSDC-RI MSDC-RI

References

Evans and Haken, 1989
Evans, M.B.; Haken, J.K., Dispersion and selectivity indices in gas chromatography. IV. Chlorinated aromatic compounds, J. Chromatogr., 1989, 468, 373-382, https://doi.org/10.1016/S0021-9673(00)96332-5 . [all data]

Haken and Korhonen, 1983
Haken, J.K.; Korhonen, I.O.O., Gas chromatography of homologous esters. XXI. Capillary column studies of the chlorinated phenyl acetates, J. Chromatogr., 1983, 257, 267-273, https://doi.org/10.1016/S0021-9673(01)88182-6 . [all data]