1-Propynol

Vibrational and/or electronic energy levels

Data compiled by: Marilyn E. Jacox

State:   X

Vib.
sym.
 No.   Approximate
 type of mode
 cm-1   Med.   Method   References

OH stretch 3430.0 T Ar IR Harrison and Frei, 1994
CC stretch 2192.7 Ar IR Harrison and Frei, 1994

Additional references: Jacox, 1998, page 338

References

Harrison and Frei, 1994
Harrison, J.A.; Frei, H., J. Phys. Cnem., 1994, 98, 12142. [all data]

Jacox, 1998
Jacox, M.E., Vibrational and electronic energy levels of polyatomic transient molecules: supplement A, J. Phys. Chem. Ref. Data, 1998, 27, 2, 115-393, https://doi.org/10.1063/1.556017 . [all data]