Hydrazine, 1,1-diethyl-

Normal alkane RI, non-polar column, temperature ramp

View large format table.

Column type Active phase I Reference Comment
CapillaryOV-101687.Zenkevich, 200525. m/0.20 mm/0.10 μm, N2/He, 6. K/min; Tstart: 50. C; Tend: 250. C

Gas phase ion energetics data

Data compiled as indicated in comments:
LLK - Sharon G. Lias, Rhoda D. Levin, and Sherif A. Kafafi
RDSH - Henry M. Rosenstock, Keith Draxl, Bruce W. Steiner, and John T. Herron

Ionization energy determinations

IE (eV) Method Reference Comment
7.96 ± 0.05PEVovna, Vilesov, et al., 1975LLK
7.59 ± 0.05PIAkopyan and Vilesov, 1963RDSH

Appearance energy determinations

Ion AE (eV) Other Products MethodReferenceComment
C3H9N2+8.0 ± 0.1CH3PIAkopyan and Vilesov, 1963RDSH
C4H10N2+8.3 ± 0.2H2PIAkopyan and Vilesov, 1963RDSH
C4H11N+11.2 ± 0.1NHPIAkopyan and Vilesov, 1963RDSH
C4H11N2+8.9 ± 0.1HPIAkopyan and Vilesov, 1963RDSH

References

Zenkevich, 2005
Zenkevich, I.G., Experimentally measured retention indices., 2005. [all data]