2-Ethylbenzoic acid

Condensed phase thermochemistry data

Data compiled as indicated in comments:
ALS - Hussein Y. Afeefy, Joel F. Liebman, and Stephen E. Stein
DH - Eugene S. Domalski and Elizabeth D. Hearing

Quantity Value Units Method Reference Comment
Δfsolid-441.4 ± 1.5kJ/molCcbColomina, Jimenez, et al., 1976ALS
Quantity Value Units Method Reference Comment
Δcsolid-4529.4 ± 3.7kJ/molCcbColomina, Jimenez, et al., 1976Corresponding Δfsolid = -441.37 kJ/mol (simple calculation by NIST; no Washburn corrections); ALS

Constant pressure heat capacity of solid

Cp,solid (J/mol*K) Temperature (K) Reference Comment
208.7298.15Colomina, Jimenez, et al., 1984Cp given as 1.39 J/g*K.; DH

References

Colomina, Jimenez, et al., 1976
Colomina, M.; Jimenez, P.; Perez-Ossorio, R.; Turrion, C., Thermochemical properties of alkylbenzoic acids VI. Enthalpies of combustion and formation of the o-, m-, and p-ethylbenzoic acids, J. Chem. Thermodyn., 1976, 8, 439-444. [all data]

Colomina, Jimenez, et al., 1984
Colomina, M.; Jimenez, P.; Roux, M.V.; Turrion, C., Thermochemical properties of benzoic acid derivatives. XI. Vapour pressures and enthalpies of sublimation and formation of the six dimethylbenzoic acids, J. Chem. Thermodyn., 1984, 16, 1121-1127. [all data]