Acridine, 9-methyl-

Lee's RI, non-polar column, temperature ramp

Data compiled by: NIST Mass Spectrometry Data Center, William E. Wallace, director

Column type Capillary
Active phase SE-52
Column length (m) 20.
Carrier gas H2
Substrate
Column diameter (mm) 0.30
Phase thickness (μm) 0.25
Tstart (C) 40.
Tend (C) 265.
Heat rate (K/min) 4.
Initial hold (min) 2.
Final hold (min)
I 331.15
ReferenceVassilaros, Kong, et al., 1982
Comment MSDC-RI

Gas phase ion energetics data

Data compiled by: Sharon G. Lias, Rhoda D. Levin, and Sherif A. Kafafi

Ionization energy determinations

IE (eV) Method Reference Comment
7.68PEJongsma, Vermeer, et al., 1975Vertical value

References

Vassilaros, Kong, et al., 1982
Vassilaros, D.L.; Kong, R.C.; Later, D.W.; Lee, M.L., Linear retention index system for polycyclic aromatic compounds. Critical evaluation and additional indices, J. Chromatogr., 1982, 252, 1-20, https://doi.org/10.1016/S0021-9673(01)88394-1 . [all data]