Naphthalene, 1-(phenylmethyl)-

Lee's RI, non-polar column, custom temperature program

View large format table.

Column type Active phase I Reference Comment
CapillaryDB-5332.88Naikwadi, Charbonneau, et al., 1987Column length: 30. m; Column diameter: 0.32 mm; Program: not specified

References

Naikwadi, Charbonneau, et al., 1987
Naikwadi, K.P.; Charbonneau, G.M.; Karasek, F.W.; Clement, R.E., Separation and Identification of Organic Compounds in Air Particulate Extracts by High-Performance Liquid Chromatography and Gas Chromatography-Mass Spectrometry, J. Chromatogr., 1987, 398, 227-237, https://doi.org/10.1016/S0021-9673(01)96508-2 . [all data]