4-Quinolinol

Condensed phase thermochemistry data

Data compiled by: Hussein Y. Afeefy, Joel F. Liebman, and Stephen E. Stein

Quantity Value Units Method Reference Comment
Δfsolid-114.3 ± 2.0kJ/molCcbRibeiro da Silva, Matos, et al., 1990
Quantity Value Units Method Reference Comment
Δcsolid-4427.7 ± 1.6kJ/molCcbRibeiro da Silva, Matos, et al., 1990

Gas phase thermochemistry data

Data compiled by: Hussein Y. Afeefy, Joel F. Liebman, and Stephen E. Stein

Quantity Value Units Method Reference Comment
Δfgas20.8 ± 2.3kJ/molCcbRibeiro da Silva, Matos, et al., 1990

References

Ribeiro da Silva, Matos, et al., 1990
Ribeiro da Silva, M.A.V.; Matos, M.A.R.; Monte, M.J.S., Enthalpies of combustion, vapour pressures, and enthalpies of sublimation of 2-hydroxyquinoline, 4-methyl-2-hydroxyquinoline, 4-hydroxyquinoline, and 2-methyl-4-hydroxyquinoline, J. Chem. Thermodyn., 1990, 22, 609-616. [all data]