4-Chloroquinoline

Phase change data

Data compiled as indicated in comments:
BS - Robert L. Brown and Stephen E. Stein
AC - William E. Acree, Jr., James S. Chickos

Quantity Value Units Method Reference Comment
Tboil533.7KN/AAldrich Chemical Company Inc., 1990BS
Quantity Value Units Method Reference Comment
Δsub18.8 ± 0.41kcal/molCda Silva, Matos, et al., 2006AC

References

Aldrich Chemical Company Inc., 1990
Aldrich Chemical Company Inc., Catalog Handbook of Fine Chemicals, Aldrich Chemical Company, Inc., Milwaukee WI, 1990, 1. [all data]

da Silva, Matos, et al., 2006
da Silva, Manuel A.V. Ribeiro; Matos, R.; Amaral, Luísa M.P.F., Standard molar enthalpies of formation of 2-chloroquinoline, 4-chloroquinoline, 6-chloroquinoline and 4,7-dichloroquinoline by rotating-bomb calorimetry, The Journal of Chemical Thermodynamics, 2006, 38, 1, 49-55, https://doi.org/10.1016/j.jct.2005.03.011 . [all data]