3,4-Dinitroaniline

Condensed phase thermochemistry data

Data compiled by: Hussein Y. Afeefy, Joel F. Liebman, and Stephen E. Stein

Quantity Value Units Method Reference Comment
Δfsolid-33.kJ/molCcbMacharacek, Zacharov, et al., 1962
Quantity Value Units Method Reference Comment
Δcsolid-3043.kJ/molCcbMacharacek, Zacharov, et al., 1962

References

Macharacek, Zacharov, et al., 1962
Macharacek, K.; Zacharov, A.I.; Aljosina, L.A., Spalna a slucovaci tepla izomernich dinitroanilinu, Chem. Prumsyl., 1962, 12, 23-24. [all data]