N-Acetylpyrrole

Kovats' RI, non-polar column, isothermal

Data compiled by: NIST Mass Spectrometry Data Center, William E. Wallace, director

Column type Packed
Active phase SE-30
Column length (m) 2.
Carrier gas N2
Substrate Chromosorb W-AW
Column diameter (mm)
Phase thickness (μm)
Temperature (C) 130.
I 948.
ReferenceTibor and Anna, 1971
Comment MSDC-RI

References

Tibor and Anna, 1971
Tibor, T.; Anna, B., Gázkromatográfiás retenció és a kémiai szerkezet, I., Magy. Kem. Foly., 1971, 77, 576-587. [all data]