2-Nitro-1-naphthol

Lee's RI, non-polar column, custom temperature program

View large format table.

Column type Active phase I Reference Comment
CapillaryOV-101287.2Tucminen, Wickstrom, et al., 1986Program: not specified

References

Tucminen, Wickstrom, et al., 1986
Tucminen, A.; Wickstrom, K.; Pyysalo, H., Determination of Polycyclic Aromatic Compounds by GLC-Selected Ion Monitoring (SIM) Technique, J. Hi. Res. Chromatogr. Chromatogr. Comm., 1986, 9, 8, 469-471, https://doi.org/10.1002/jhrc.1240090813 . [all data]