1-Fluoro-1,1,3,5,5-pentanitro-3-azaheptane

Condensed phase thermochemistry data

Data compiled by: Hussein Y. Afeefy, Joel F. Liebman, and Stephen E. Stein

Quantity Value Units Method Reference Comment
Δfsolid-403.3 ± 3.4kJ/molCcbKustova, Rubtsov, et al., 1976Reanalyzed by Pedley, Naylor, et al., 1986, Original value = -404. ± 3. kJ/mol
Quantity Value Units Method Reference Comment
Δcsolid-3423. ± 3.kJ/molCcbKustova, Rubtsov, et al., 1976

References

Kustova, Rubtsov, et al., 1976
Kustova, L.V.; Rubtsov, Yu.I.; Kirpichev, E.P.; Eremenko, L.T.; Gafurov, R.G.; Korepin, A.G., The standard enthalpies of formation of certain N-(fluoropolynitroalkyl)-N-nitramines, Russ. J. Phys. Chem. (Engl. Transl.), 1976, 50, 1150. [all data]

Pedley, Naylor, et al., 1986
Pedley, J.B.; Naylor, R.D.; Kirby, S.P., Thermochemical Data of Organic Compounds, Chapman and Hall, New York, 1986, 1-792. [all data]