2-propenoyl fluoride, 2-fluoro-

Phase change data

Data compiled by: Thermodynamics Research Center, NIST Boulder Laboratories, Chris Muzny director

Quantity Value Units Method Reference Comment
Tboil333.15KN/ADurig, Wang, et al., 1989Uncertainty assigned by TRC = 5. K

In addition to the Thermodynamics Research Center (TRC) data available from this site, much more physical and chemical property data is available from the following TRC products:

References

Durig, Wang, et al., 1989
Durig, J.R.; Wang, A.Y.; Little, T.S.; Brletic, P.A.; Bucenell, J.R., Conformational stability, barriers to internal rotation, vibrationa assignment and ab initio calculations of 2-fluoropropenoyl fluoride, J. Chem. Phys., 1989, 91, 7361. [all data]