Diphenic anhydride

Phase change data

Data compiled by: William E. Acree, Jr., James S. Chickos

Quantity Value Units Method Reference Comment
Δsub120.7 ± 4.0kJ/molCMatos, Miranda, et al., 2005

Enthalpy of sublimation

ΔsubH (kJ/mol) Temperature (K) Method Reference Comment
91.4448.AStephenson and Malanowski, 1987Based on data from 433. - 490. K.

References

Matos, Miranda, et al., 2005
Matos, M. Agostinha R.; Miranda, Margarida S.; Pinto, Natália A.B.; Morais, Victor M.F.; Dhananjaya, N.; Liebman *, Joel F., Thermochemistry of diphenic anhydride. A combined experimental and theoretical study, Molecular Physics, 2005, 103, 14, 1885-1894, https://doi.org/10.1080/00268970500096301 . [all data]

Stephenson and Malanowski, 1987
Stephenson, Richard M.; Malanowski, Stanislaw, Handbook of the Thermodynamics of Organic Compounds, 1987, https://doi.org/10.1007/978-94-009-3173-2 . [all data]