Benzene, 1,3,5-trimethyl-2-nitro-

Gas phase thermochemistry data

Data compiled by: Hussein Y. Afeefy, Joel F. Liebman, and Stephen E. Stein

Quantity Value Units Method Reference Comment
Δfgas-26.8 ± 2.2kJ/molCcbAcree, Tucker, et al., 1993

Condensed phase thermochemistry data

Data compiled by: Hussein Y. Afeefy, Joel F. Liebman, and Stephen E. Stein

Quantity Value Units Method Reference Comment
Δfsolid-25.19 ± 0.48kcal/molCcbAcree, Tucker, et al., 1993crystal phase
Quantity Value Units Method Reference Comment
Δcsolid-1197.0 ± 0.38kcal/molCcbAcree, Tucker, et al., 1993crystal phase

Phase change data

Data compiled as indicated in comments:
BS - Robert L. Brown and Stephen E. Stein
TRC - Thermodynamics Research Center, NIST Boulder Laboratories, Chris Muzny director
ALS - Hussein Y. Afeefy, Joel F. Liebman, and Stephen E. Stein
AC - William E. Acree, Jr., James S. Chickos

Quantity Value Units Method Reference Comment
Tboil528.2KN/AWeast and Grasselli, 1989BS
Quantity Value Units Method Reference Comment
Tfus317.KN/AWhite, Biggs, et al., 1940Uncertainty assigned by TRC = 1.5 K; TRC
Quantity Value Units Method Reference Comment
Δsub18.8 ± 0.24kcal/molCAcree, Tucker, et al., 1993crystal phase; ALS
Δsub18.8 ± 0.24kcal/molCAcree, Tucker, et al., 1993See also Acree, Tucker, et al., 1993.; AC

In addition to the Thermodynamics Research Center (TRC) data available from this site, much more physical and chemical property data is available from the following TRC products:

References

Acree, Tucker, et al., 1993
Acree, W.E., Jr.; Tucker, S.A.; Pilcher, G.; Chowdhary, A.; Ribeiro da Silva, M.D.M.; Monte, M.J.S., Enthalpies of combustion of 2,2',4,4',6,6'-hexamethylazobenzene-N,N-dioxide, 2,2',6,6'-tetramethylazobenzene-N,N-dioxide, 2,4,6-trimethylnitrobenzene, and 2,6-dimethyl-nitrobenzene: the dissociation enthalpies of the N=N and N-O bonds, J. Chem. Thermodyn., 1993, 25, 1253-1261. [all data]