Ethyl diacetoacetate

Condensed phase thermochemistry data

Data compiled by: Hussein Y. Afeefy, Joel F. Liebman, and Stephen E. Stein

Quantity Value Units Method Reference Comment
Δfliquid-789.5kJ/molCcbGuinchant, 1918Author hf288_condensed[kcal/mol]=-196.0 kcal/mol
Quantity Value Units Method Reference Comment
Δcliquid-4073.5kJ/molCcbGuinchant, 1918Author hf288_condensed[kcal/mol]=-196.0 kcal/mol; Corresponding Δfliquid = -789.60 kJ/mol (simple calculation by NIST; no Washburn corrections)

References

Guinchant, 1918
Guinchant, M.J., Etude sur la fonction acide dans les derives metheniques et methiniques, Ann. Chem., 1918, 10, 30-84. [all data]