24-Norcholan-23-oic acid, 3,12-bis(acetyloxy)-, methyl ester, (3α,5β,12α)-

Normal alkane RI, non-polar column, temperature ramp

Data compiled by: NIST Mass Spectrometry Data Center, William E. Wallace, director

Column type Capillary
Active phase CP Sil 5 CB
Column length (m) 25.
Carrier gas He
Substrate
Column diameter (mm) 0.22
Phase thickness (μm)
Tstart (C) 100.
Tend (C) 278.
Heat rate (K/min) 35.
Initial hold (min)
Final hold (min)
I 3155.
ReferenceBatta, Salen, et al., 1997
Comment MSDC-RI

References

Batta, Salen, et al., 1997
Batta, A.K.; Salen, G.; Batta, M.; Earnest, D.; Alberts, D., Capillary gas-liquid chromatography of acetate-methyl esters of bile acids, J. Chromatogr. A, 1997, 766, 1-2, 286-291, https://doi.org/10.1016/S0021-9673(96)01016-3 . [all data]