Tricyclobutenobenzene

Gas phase ion energetics data

Data compiled as indicated in comments:
LLK - Sharon G. Lias, Rhoda D. Levin, and Sherif A. Kafafi

Ionization energy determinations

IE (eV) Method Reference Comment
8.15 ± 0.05PEHeilbronner, Kovac, et al., 1981LLK

References

Heilbronner, Kovac, et al., 1981
Heilbronner, E.; Kovac, B.; Nutakul, W.; Taggart, A.D.; Thummel, R.P., Trisannelated benzenes. Preparation, properties, and photoelectron spectra, J. Org. Chem., 1981, 46, 5279. [all data]