Acridine, 9-phenyl-

Gas phase ion energetics data

Data compiled by: Sharon G. Lias, Rhoda D. Levin, and Sherif A. Kafafi

Ionization energy determinations

IE (eV) Method Reference Comment
7.75PEJongsma, Vermeer, et al., 1975Vertical value
7.80PESchafer, Schweig, et al., 1972Vertical value

References

Jongsma, Vermeer, et al., 1975
Jongsma, C.; Vermeer, H.; Bickelhaupt, F.; Schafer, W.; Schweig, A., 10-methyl-9-phosphaanthracene, Tetrahedron, 1975, 31, 2931. [all data]

Schafer, Schweig, et al., 1972
Schafer, W.; Schweig, A.; Bickelhaupt, F.; Vermeer, H., Photoelectron spectroscopy and conjugation. Direct proof of the unusual sequence of the two highest occupied π-molecular orbitals in the phosphorin (phosphabenzene) and the arsenin (arsabenzene) system, Angew. Chem. Int. Ed. Engl., 1972, 11, 924. [all data]