ethylisobutylmethylamine

Phase change data

Data compiled by: Thermodynamics Research Center, NIST Boulder Laboratories, Chris Muzny director

Quantity Value Units Method Reference Comment
Tboil379.65KN/ACope, Lebel, et al., 1957Uncertainty assigned by TRC = 2. K
Tboil378.15KN/AMarckwald and Droste-Huelshoff, 1899Uncertainty assigned by TRC = 3. K

In addition to the Thermodynamics Research Center (TRC) data available from this site, much more physical and chemical property data is available from the following TRC products:

References

Cope, Lebel, et al., 1957
Cope, A.C.; Lebel, N.A.; Lee, H.-H.; Moore, W.R., Amine oxides: III selective formation of olefins from unsymmetrical amine oxides and quaternary ammonium hydroxides, J. Am. Chem. Soc., 1957, 79, 4720. [all data]

Marckwald and Droste-Huelshoff, 1899
Marckwald, W.; Droste-Huelshoff, Chem. Ber., 1899, 32, 560. [all data]