Phosphoramidous difluoride, (difluoroboryl)-

Gas phase ion energetics data

Data compiled by: Sharon G. Lias, Rhoda D. Levin, and Sherif A. Kafafi

Ionization energy determinations

IE (eV) Method Reference Comment
11.5 ± 0.1PEArnold, Ebsworth, et al., 1976Vertical value

References

Arnold, Ebsworth, et al., 1976
Arnold, D.E.J.; Ebsworth, E.A.V.; Rankin, D.W.H., Preparation and properties of difluoro- (difluorophosphinoamino)borane, J. Chem. Soc. Dalton Trans., 1976, 823. [all data]