Cyclopropane,(1-ethyl-1,2-butadienyl)-

Gas phase ion energetics data

Data compiled by: Sharon G. Lias, Rhoda D. Levin, and Sherif A. Kafafi

Ionization energy determinations

IE (eV) Method Reference
8.60PEDewar, Fonken, et al., 1976

References

Dewar, Fonken, et al., 1976
Dewar, M.J.S.; Fonken, G.J.; Jones, T.B.; Minter, D.E., Photoelectron spectra of molecules. Part VII. Cyclopropylallenes, J. Chem. Soc. Perkin Trans. 2, 1976, 764. [all data]