Methyl lithocholate, (3α,5β)-, TMS derivative

Normal alkane RI, non-polar column, isothermal

View large format table.

Column type Active phase Temperature (C) I Reference Comment
CapillaryOV-1270.3133.Lawson and Setchell, 198818. m/0.20 mm/0.25 μm, He

Normal alkane RI, non-polar column, temperature ramp

View large format table.

Column type Active phase I Reference Comment
CapillaryCP Sil 5 CB3179.Batta and Salen, 1999He, 100. C @ 2. min, 35. K/min; Column length: 25. m; Column diameter: 0.22 mm; Tend: 278. C
CapillaryCP Sil 5 CB3157.Batta, Aggarwal, et al., 1995He, 100. C @ 2. min, 35. K/min; Column length: 25. m; Column diameter: 0.22 mm; Tend: 278. C

Normal alkane RI, non-polar column, custom temperature program

View large format table.

Column type Active phase I Reference Comment
CapillaryMethyl Silicone3103.Meng, Reyes, et al., 1997Program: not specified
CapillaryMethyl Silicone3103.Meng and Sjövall, 199725. m/0.32 mm/0.25 μm; Program: 60 0C 30 K/min -> 210 0C (1.5 min) 2.5 K/min -> 320 0C (20 min)
CapillaryOV-13133.Iida, Momose, et al., 198718. m/0.20 mm/0.25 μm, He; Program: not specified

Normal alkane RI, polar column, custom temperature program

View large format table.

Column type Active phase I Reference Comment
CapillaryDB-Wax3647.Iida, Momose, et al., 198715. m/0.25 mm/0.25 μm, He; Program: not specified

References

Lawson and Setchell, 1988
Lawson, A.M.; Setchell, K.D.R., Appendix of GC retention indices. List of retention indices foe methyl ester - trimethylsilyl (Me-TMS) ether derivatives of bile acids, The Bile Acids. Vol. 4, Methods and Applications, 1988, 4, 571-575. [all data]

Batta and Salen, 1999
Batta, A.K.; Salen, G., Gas chromatography of bile acids, J. Chromatogr. B, 1999, 723, 1-2, 1-16, https://doi.org/10.1016/S0378-4347(98)00528-3 . [all data]

Batta, Aggarwal, et al., 1995
Batta, A.K.; Aggarwal, S.K.; Tint, G.S.; Batta, M.; Salen, G., Capillary gas-liquid chromatography of 6-hydroxylated bile acids, J. Chromatogr. A, 1995, 704, 1, 228-233, https://doi.org/10.1016/0021-9673(95)00183-N . [all data]

Meng, Reyes, et al., 1997
Meng, L.-J.; Reyes, H.; Palma, J.; Hernandez, I.; Ribalta, J.; Sjövall, J., Profiles of bile acids and progesterone metabolites in the urine and serum of women with intrahepatic cholestasis of pregnancy, J. Hepatol., 1997, 27, 2, 346-357, https://doi.org/10.1016/S0168-8278(97)80181-X . [all data]

Meng and Sjövall, 1997
Meng, L.-J.; Sjövall, J., Method for combined analysis of profiles of conjugated progesterone metabolites and bile acids in serum and urine of pregnant women, J. Chromatogr. B, 1997, 688, 1, 11-26, https://doi.org/10.1016/S0378-4347(97)88051-6 . [all data]

Iida, Momose, et al., 1987
Iida, T.; Momose, T.; Tamura, T.; Matsumoto, T.; Goto, J.; Nambara, T.; Chang, F.C., Capillary gas chromatography of hydroxylated bile acid stereoisomers of the allo and normal series, J. Chromatogr., 1987, 389, 155-164, https://doi.org/10.1016/S0021-9673(01)94419-X . [all data]