Ethanamine, N,N-dimethyl-

Kovats' RI, non-polar column, isothermal

View large format table.

Column type Active phase Temperature (C) I Reference Comment
PackedApiezon L80.510.Zhuravleva, Golovnya, et al., 1981Chromosorb G AW (80-100 mesh); Column length: 2.7 m
PackedApiezon L80.516.Zhuravleva, Golovnya, et al., 1981Chromosorb G AW (80-100 mesh); Column length: 2.7 m

Normal alkane RI, non-polar column, custom temperature program

View large format table.

Column type Active phase I Reference Comment
CapillaryPolydimethyl siloxanes504.Zenkevich, Chupalov, et al., 1996Program: not specified

References

Zhuravleva, Golovnya, et al., 1981
Zhuravleva, I.L.; Golovnya, R.V.; Terenina, M.B.; Grigorieva, D.N., Gas chromatographic behaviour of some unsymmetrical tertiary amines, Zh. Anal. Khim., 1981, 36, 968-975. [all data]

Zenkevich, Chupalov, et al., 1996
Zenkevich, I.G.; Chupalov, A.A.; Herzschuh, R., Correlation of the Increments of Gas Chromatographic Retention Indices with the Differences of Innermolecular Energies of Reagents and Products of Chemical Reactions, Zh. Org. Khim. (Rus.), 1996, 32, 11, 1685-1691. [all data]