Sulphuric acid dipropyl ester

Condensed phase thermochemistry data

Data compiled by: Hussein Y. Afeefy, Joel F. Liebman, and Stephen E. Stein

Quantity Value Units Method Reference Comment
Δfliquid-858.7 ± 1.2kJ/molCcbMackle and Steele, 1969
Quantity Value Units Method Reference Comment
Δcliquid-4105.2 ± 1.1kJ/molCcbMackle and Steele, 1969Reanalyzed by Cox and Pilcher, 1970, Original value = -4104.6 ± 2.2 kJ/mol

References

Mackle and Steele, 1969
Mackle, H.; Steele, W.V., Studies in the thermochemistry of organic sulphites and sulphates. Part 1.-Heats of combustion and formation of some dialkyl sulphites and sulphates, Trans. Faraday Soc., 1969, 65, 2053-2059. [all data]

Cox and Pilcher, 1970
Cox, J.D.; Pilcher, G., Thermochemistry of Organic and Organometallic Compounds, Academic Press, New York, 1970, 1-636. [all data]