Niacin

Gas phase thermochemistry data

Data compiled by: Hussein Y. Afeefy, Joel F. Liebman, and Stephen E. Stein

Quantity Value Units Method Reference Comment
Δfgas-221.5 ± 1.5kJ/molCcbBickerton, Pilcher, et al., 1984Author was aware that data differs from previously reported values

Condensed phase thermochemistry data

Data compiled by: Hussein Y. Afeefy, Joel F. Liebman, and Stephen E. Stein

Quantity Value Units Method Reference Comment
Δfsolid-82.4 ± 0.2kcal/molCcbBickerton, Pilcher, et al., 1984Author was aware that data differs from previously reported values
Δfsolid-82.41 ± 0.22kcal/molCcrSato-Toshima, Kamagughi, et al., 1983Author was aware that data differs from previously reported values
Δfsolid-82.45 ± 0.16kcal/molCcrJohnson, 1975
Quantity Value Units Method Reference Comment
Δcsolid-652.68 ± 0.11kcal/molCcrSato-Toshima, Kamagughi, et al., 1983Author was aware that data differs from previously reported values
Δcsolid-652.65 ± 0.14kcal/molCcrJohnson, 1975

References

Bickerton, Pilcher, et al., 1984
Bickerton, J.; Pilcher, G.; Al-Takhin, G., Enthalpies of combustion of the three aminopyridines and the three cyanopyridines, J. Chem. Thermodyn., 1984, 16, 373-378. [all data]