Chlorine thiocyanate

Gas phase ion energetics data

Data compiled by: Sharon G. Lias, Rhoda D. Levin, and Sherif A. Kafafi

Ionization energy determinations

IE (eV) Method Reference
10.45 ± 0.02PEFrost, MacDonald, et al., 1981

References

Frost, MacDonald, et al., 1981
Frost, D.C.; MacDonald, C.B.; McDowell, C.A.; Westwood, N.P.C., Preparation and HeI photoelectron spectra of the halogen thiocyanates, XSCN (X = Cl and Br), J. Am. Chem. Soc., 1981, 103, 4423. [all data]