Ethanol, pentamethyl-

Phase change data

Data compiled as indicated in comments:
TRC - Thermodynamics Research Center, NIST Boulder Laboratories, Chris Muzny director
AC - William E. Acree, Jr., James S. Chickos

Quantity Value Units Method Reference Comment
Tboil403. ± 3.KAVGN/AAverage of 9 values; Individual data points
Quantity Value Units Method Reference Comment
Tfus290.15KN/AEdgar, Calingaert, et al., 1929Uncertainty assigned by TRC = 1.5 K; TRC

Enthalpy of vaporization

ΔvapH (kcal/mol) Temperature (K) Method Reference Comment
11.6313.MMWieczorek and Sipowska, 1985Based on data from 298. - 363. K.; AC

In addition to the Thermodynamics Research Center (TRC) data available from this site, much more physical and chemical property data is available from the following TRC products:

References

Edgar, Calingaert, et al., 1929
Edgar, G.; Calingaert, G.; Marker, R.E., Preparation and Properties of the Isomeric Heptanes I. Preparation Preparation., J. Am. Chem. Soc., 1929, 51, 1483. [all data]

Wieczorek and Sipowska, 1985
Wieczorek, Stefan A.; Sipowska, Jadwiga T., Vapour pressures and excess Gibbs free energies of (2,3,3-trimethylbutan-2-ol + n-heptane) between 298.150 and 363.279 K, The Journal of Chemical Thermodynamics, 1985, 17, 3, 255-261, https://doi.org/10.1016/0021-9614(85)90019-9 . [all data]